{"text_format":"1","workbook":"xlsx","n_sheets":9,"sheets":["Tiitel","aeg&ruum_E","biorütmid_1","biorütmid_2","biotabel_1","biotabel_2","Eesti","abi","tabelid"],"not_rendered":{"charts":2,"images":10,"macros":1,"external_links":0,"defined_names":62,"comments":3,"pivot_tables":0},"unopened":[],"bounds":{"document_bytes":16777216,"sheet_cells":100000,"rows_first":2000,"rows_last":500,"rows_between":2000,"halvings":0,"cell_chars":16384,"cell_head_chars":4096},"cells_cut":0,"cells_raw":0,"read":"whole","date_system":"1900"}

{"sheet":"Tiitel","index":0,"n_rows":15,"n_cols":3,"rows_kept":15,"cut":false,"hidden":false,"merged":[[10,2,10,3],[12,2,12,3],[14,2,14,3]]}
[]
[]
[]
[]
[]
[]
[]
[]
[]
[]
[null,null,"Aeg & ruum"]
[]
[null,null,"Biorütmid"]
[]
[null,null,"Viktoriin"]

{"sheet":"aeg&ruum_E","index":1,"n_rows":19,"n_cols":5,"rows_kept":19,"cut":false,"hidden":false,"merged":[]}
[]
[null,null,"Aeg ja ruum"]
[]
[null,null,"Nimi","Peeter","nimi"]
[null,null,"pikkus (cm)",184,"L"]
[null,null,"mass (kg)",68,"m"]
[null,null,"sünniaeg","1991-10-26","sa"]
[null,null,"sugu","mees","sugu"]
[null,null,"vanus aastates",{"$f":"(TODAY()-sa)/365.25","v":23.479808350444902},"va"]
[null,null,"vanus päevades",{"$f":"TODAY()-sa","v":8576},"vp"]
[null,null,"tähtkuju",{"$f":"VLOOKUP(DATE(99,MONTH(sa),DAY(sa)),tähtkujud,2)","v":"Skorpion"},{"$f":"VLOOKUP(DATE(99,MONTH(sa),DAY(sa)),tähtkujud,3)","v":"e"}]
[null,null,"sünniaasta nimi\nidamaa kalendris",{"$f":"INDEX(Ida_aasta,MOD(YEAR(sa)-1899,12)+1)","v":"siku"}]
[null,null,"ideaalne mass (kg)",{"$f":"IF(sugu=\"naine\",(3*L-450+va)*0.225+40.5,(3*L-450+va)*0.25+45)","v":76.369952087611225}]
[null,null,"rasvasus (%)",{"$f":"IF(sugu=\"naine\",(m-I_mass)/m*100+22,(m-I_mass)/m*100+15)","v":2.6912469299834942},{"$f":"LOOKUP(rasv,IF(sugu=\"naine\",r_naine,r_mees),r_tekst)","v":"normaalne"}]
[null,null,"keha indeks",{"$f":"m/(L/100)^2","v":20.085066162570886},{"$f":"LOOKUP(ind,r_ind,r_tekst)","v":"normaalne"}]
[null,null,"tihedus (kg/m3)",{"$f":"8.9*rasv+11*(100-rasv)","v":1094.3483814470346}]
[null,null,"ruumala (dm3)",{"$f":"1000*m/tihe","v":62.137433702862502}]
[null,null,"pindala (m2)",{"$f":"(1000*m)^y*L^0.3/3118.2","v":1.8471071674290533}]
[null,null,null,{"$f":"(35.75-LOG(m))/53.2","v":0.63754682494913084},"y"]

{"sheet":"biorütmid_1","index":2,"n_rows":9,"n_cols":12,"rows_kept":9,"cut":false,"hidden":false,"merged":[[6,2,6,3],[6,4,6,5],[6,10,6,11],[6,6,6,7],[6,8,6,9]]}
[]
[null,null,"Biorütmid",null,null,null,null,null,null,"Üldine biorütm vahemikus:"]
[null,null,null,null,null,null,null,null,null,null,{"$f":"Sünniaeg","v":"1942-12-24"},{"$f":"TODAY()","v":"2015-04-19"}]
[null,null,"Nimi","Sünniaeg",null,"algus","jooksev",0,null,"max",3.9537512712840601,"1950-01-18"]
[null,null,{"$f":"nimi","v":"Peeter"},"1942-12-24",null,"2014-02-01",{"$f":"alg+H4","v":"2014-02-01"},null,null,"min",-3.9602386775940142,"1969-10-16"]
[]
[null,null,"emotsionaalne",null,"füüsiline",null,"intelektuaalne",null,"sotsiaalne",null,"üldine"]
[null,"max",{"$f":"MAX(emots)","v":1},{"$f":"INDEX(kuupäev,MATCH(C8,emots,0))","v":"2014-02-20"},{"$f":"MAX(füüs)","v":0.99766876919059122},{"$f":"INDEX(kuupäev,MATCH(E8,füüs,0))","v":"2014-02-25"},{"$f":"MAX(intel)","v":0.99886733918296911},{"$f":"INDEX(kuupäev,MATCH(G8,intel,0))","v":"2014-02-08"},{"$f":"MAX(sots)","v":0.99802672842826889},{"$f":"INDEX(kuupäev,MATCH(I8,sots,0))","v":"2014-02-10"},{"$f":"MAX(üldine)","v":0.81759741116646689},{"$f":"INDEX(kuupäev,MATCH(K8,üldine,0))","v":"2014-02-07"}]
[null,"min",{"$f":"MIN(emots)","v":-1},{"$f":"INDEX(kuupäev,MATCH(C9,emots,0))","v":"2014-02-06"},{"$f":"MIN(füüs)","v":-0.9976687691904933},{"$f":"INDEX(kuupäev,MATCH(E9,füüs,0))","v":"2014-02-13"},{"$f":"MIN(intel)","v":-0.99886733918301618},{"$f":"INDEX(kuupäev,MATCH(G9,intel,0))","v":"2014-02-25"},{"$f":"MIN(sots)","v":-0.998026728428271},{"$f":"INDEX(kuupäev,MATCH(I9,sots,0))","v":"2014-02-23"},{"$f":"MIN(üldine)","v":-0.80790691312374818},{"$f":"INDEX(kuupäev,MATCH(K9,üldine,0))","v":"2014-03-03"}]

{"sheet":"biorütmid_2","index":3,"n_rows":9,"n_cols":11,"rows_kept":9,"cut":false,"hidden":false,"merged":[[2,2,2,3],[2,4,2,5],[3,2,3,3],[4,2,4,3],[3,4,3,5],[4,4,4,5]]}
[]
[null,"Koostöö, sõprus, armastus jm"]
[null,null,"Isik_1",null,"Isik_2",null,"algus","jooksev",25]
[null,"Nimi","Pille",null,"Kalle",null,"2014-01-01",{"$f":"G4+I3","v":"2014-01-26"}]
[null,"Sünniaeg","1980-06-24",null,"1980-12-24",null,{"$f":"IF(valik=TRUE,\"Max_Ü koos\",\"Max_\"&lüh&\" koos\")","v":"Max_Ü koos"},{"$f":"IF(valik=TRUE,\"Min_Ü koos\",\"Min_\"&lüh&\" koos\")","v":"Min_Ü koos"},"Biorütm"]
[null,"max Üld",{"$f":"IF(valik=TRUE,MAX(Yld_1),\"\")","v":1.3140366198122393},{"$f":"IF(valik=TRUE,INDEX(kuup,MATCH(C6,Yld_1,0)),\"\")","v":"2014-02-10"},{"$f":"IF(valik=TRUE,MAX(Yld_2),\"\")","v":1.8846543109618499},{"$f":"IF(valik=TRUE,INDEX(kuup,MATCH(E6,Yld_2,0)),\"\")","v":"2014-02-14"},{"$f":"IF(valik=TRUE,MAX(Koos),MAX(koos_S))","v":2.9145868956794341},{"$f":"IF(valik=TRUE,MIN(Koos),MIN(koos_S))","v":-3.111455965726349},"füüsiline"]
[null,"min Üld",{"$f":"IF(valik=TRUE,MIN(Yld_1),\"\")","v":-1.3562977053908769},{"$f":"IF(valik=TRUE,INDEX(kuup,MATCH(C7,Yld_1,0)),\"\")","v":"2014-02-23"},{"$f":"IF(valik=TRUE,MIN(Yld_2),\"\")","v":-2.3031285834284452},{"$f":"IF(valik=TRUE,INDEX(kuup,MATCH(E7,Yld_2,0)),\"\")","v":"2014-02-02"},{"$f":"IF(valik=TRUE,INDEX(kuup,MATCH(G6,Koos,0)),INDEX(kuup,MATCH(G6,koos_S,0)))","v":"2014-02-13"},{"$f":"IF(valik=TRUE,INDEX(kuup,MATCH(H6,Koos,0)),INDEX(kuup,MATCH(H6,koos_S,0)))","v":"2014-02-24"},null,null,true]
[null,{"$f":"\"max \"&I6","v":"max füüsiline"},{"$f":"MAX(S_1)","v":0.99766876919055214},{"$f":"MAX(S_2)","v":0.99766876919057146}]
[null,{"$f":"\"min \"&I6","v":"min füüsiline"},{"$f":"MIN(S_2)","v":-0.99766876919054415},{"$f":"MIN(S_2)","v":-0.99766876919054415}]

{"sheet":"biotabel_1","index":4,"n_rows":32,"n_cols":7,"rows_kept":32,"cut":false,"hidden":false,"merged":[]}
["kuupäev","t","emots","füüs","intel","sots","üldine"]
[{"$f":"jooksev","v":"2014-02-01"},{"$f":"A2-Sünniaeg","v":25972},{"$f":"SIN(2*PI()*t/28)","v":-0.43388373911765421},{"$f":"SIN(2*PI()*t/23)","v":0.97908408768238953},{"$f":"SIN(2*PI()*t/33)","v":0.18925124436066146},{"$f":"SIN(2*PI()*t/25)","v":-0.68454710592838941},{"$f":"SUM(C2:F2)","v":4.9904486997007336E-2}]
[{"$f":"A2+1","v":"2014-02-02"},{"$f":"A3-Sünniaeg","v":25973},{"$f":"SIN(2*PI()*t/28)","v":-0.62348980185863223},{"$f":"SIN(2*PI()*t/23)","v":0.99766876919057423},{"$f":"SIN(2*PI()*t/33)","v":0.3716624556603022},{"$f":"SIN(2*PI()*t/25)","v":-0.48175367410184244},{"$f":"SUM(C3:F3)","v":0.26408774889040176}]
[{"$f":"A3+1","v":"2014-02-03"},25974,-0.78183148246836875,0.94226092211866508,0.5406408174561016,-0.24868988716465265,0.45238036994174524]
["2014-02-04",25975,-0.90096886790255248,0.81696989301065948,0.69007901148234063,-3.4695640457882426E-13,0.60608003659010068]
["2014-02-05",25976,-0.9749279121816371,0.63108794432629234,0.81457595205035471,0.24868988716398052,0.7194258713589905]
["2014-02-06",25977,-1,0.39840108984562794,0.90963199535441441,0.4817536741020314,0.78978675930207376]
["2014-02-07",25978,-0.97492791218191288,0.13616664909641732,0.97181156832341586,0.68454710592854662,0.81759741116646689]
["2014-02-08",25979,-0.90096886790269581,-0.13616664909524245,0.99886733918296911,0.84432792550161284,0.80605974768664357]
["2014-02-09",25980,-0.7818314824680076,-0.39840108984620859,0.98982144188095977,0.95105651629531207,0.76064538586205566]
["2014-02-10",25981,-0.62348980185889047,-0.63108794432607795,0.94500081871482333,0.99802672842826889,0.68844980095812391]
["2014-02-11",25982,-0.43388373911795181,-0.81696989300997558,0.86602540378481696,0.98228725072880085,0.59745902238569049]
["2014-02-12",25983,-0.22252093395608408,-0.94226092211887713,0.75574957435434365,0.90482705246612372,0.49579477074550615]
["2014-02-13",25984,-1.3877787807814457E-17,-0.9976687691904933,0.61815898622093013,0.77051324277571964,0.39100345980615647]
["2014-02-14",25985,0.22252093395608405,-0.97908408768244581,0.45822652172802952,0.5877852522928344,0.28944862029450219]
["2014-02-15",25986,0.43388373911795181,-0.88788521840220325,0.28173255684149706,0.36812455268476413,0.19585563024200975]
["2014-02-16",25987,0.62348980185817937,-0.73083596427844322,9.5056043304534432E-2,0.12533323356494747,0.11304311444921805]
["2014-02-17",25988,0.78183148246744061,-0.51958395003577462,-9.5056043303549026E-2,-0.12533323356310974,4.1858255565007219E-2]
["2014-02-18",25989,0.90096886790230113,-0.26979677115734296,-0.28173255684141996,-0.36812455268473315,-1.8685012781194998E-2]
["2014-02-19",25990,0.97492791218171049,-2.6267269609414612E-13,-0.45822652172714967,-0.58778525229207157,-7.1083861837773488E-2]
["2014-02-20",25991,1,0.26979677115596129,-0.61815898622015208,-0.77051324277511868,-0.11887545783930953]
["2014-02-21",25992,0.97492791218183938,0.51958395003532576,-0.75574957435429091,-0.9048270524661095,-0.16606476460323527]
["2014-02-22",25993,0.90096886790255248,0.73083596427746378,-0.86602540378432202,-0.98228725072862422,-0.21650782233292998]
["2014-02-23",25994,0.78183148246780176,0.88788521840237999,-0.94500081871479702,-0.998026728428271,-0.27331084627288638]
["2014-02-24",25995,0.62348980185863223,0.9790840876823389,-0.98982144188094834,-0.95105651629532229,-0.33830406863529949]
["2014-02-25",25996,0.43388373911765427,0.99766876919059122,-0.99886733918301618,-0.8443279255021181,-0.41164275637688885]
["2014-02-26",25997,0.22252093395576208,0.94226092211874846,-0.97181156832343485,-0.68454710592857093,-0.49157681817749532]
["2014-02-27",25998,5.7922872227778033E-13,0.81696989301080303,-0.90963199535444772,-0.4817536741020606,-0.57441577644512609]
["2014-02-28",25999,-0.22252093395551936,0.63108794432648552,-0.81457595205040134,-0.24868988716577467,-0.6546988288452098]
["2014-03-01",26000,-0.43388373911742995,0.39840108984585626,-0.69007901148174056,3.1360330998708719E-13,-0.72556166075300055]
["2014-03-02",26001,-0.62348980185843761,0.13616664909666393,-0.54064081745540404,0.24868988716462034,-0.7792740830525573]
["2014-03-03",26002,-0.78183148246764644,-0.13616664909589687,-0.37166245566122119,0.48175367410101622,-0.80790691312374818]

{"sheet":"biotabel_2","index":5,"n_rows":32,"n_cols":9,"rows_kept":32,"cut":false,"hidden":false,"merged":[]}
["kuup","t_1","t_2",{"$f":"nimi_1&\"_\"&lüh","v":"Pille_F"},{"$f":"nimi_2&\"_\"&lüh","v":"Kalle_F"},{"$f":"\"koos_\"&lüh","v":"koos_F"},{"$f":"nimi_1&\"_Ü\"","v":"Pille_Ü"},{"$f":"nimi_2&\"_Ü\"","v":"Kalle_Ü"},"Koos_Ü"]
[{"$f":"algus","v":"2014-01-26"},{"$f":"kuup-saeg_1","v":12269},{"$f":"kuup-saeg_2","v":12086},{"$f":"k*SIN(2*PI()*t_1/a)","v":0.39840108984593714},{"$f":"k*SIN(2*PI()*t_2/a)","v":0.13616664909612991},{"$f":"D2+E2","v":0.53456773894206711},{"$f":"ky*(SIN(2*PI()*t_1/23)+SIN(2*PI()*t_1/33)+SIN(2*PI()*t_1/28)+SIN(2*PI()*t_1/25))","v":-0.6704683390033459},{"$f":"ky*(SIN(2*PI()*t_2/23)+SIN(2*PI()*t_2/33)+SIN(2*PI()*t_2/28)+SIN(2*PI()*t_2/25))","v":0.72132705849579337},{"$f":"G2+H2","v":5.0858719492447468E-2}]
[{"$f":"A2+1","v":"2014-01-27"},{"$f":"kuup-saeg_1","v":12270},{"$f":"kuup-saeg_2","v":12087},{"$f":"k*SIN(2*PI()*t_1/a)","v":0.1361666490967513},{"$f":"k*SIN(2*PI()*t_2/a)","v":-0.13616664909598039},{"$f":"D3+E3","v":7.7091111272409307E-13},{"$f":"ky*(SIN(2*PI()*t_1/23)+SIN(2*PI()*t_1/33)+SIN(2*PI()*t_1/28)+SIN(2*PI()*t_1/25))","v":-0.74959395037145116},{"$f":"ky*(SIN(2*PI()*t_2/23)+SIN(2*PI()*t_2/33)+SIN(2*PI()*t_2/28)+SIN(2*PI()*t_2/25))","v":7.80191584475384E-2},{"$f":"G3+H3","v":-0.67157479192391278}]
[{"$f":"A3+1","v":"2014-01-28"},12271,12088,-0.13616664909626,-0.3984010898460576,-0.53456773894231757,-0.79507052664872291,-0.55366141687726889,-1.3487319435259919]
["2014-01-29",12272,12089,-0.3984010898463165,-0.63108794432595028,-1.0294890341722667,-0.79809929507538757,-1.1331870932263519,-1.9312863883017395]
["2014-01-30",12273,12090,-0.6310879443258165,-0.81696989301014289,-1.4480578373359594,-0.75251356798105151,-1.6239334831297043,-2.3764470511107558]
["2014-01-31",12274,12091,-0.81696989301030565,-0.94226092211866963,-1.7592308151289753,-0.65549075336788043,-1.9955840465760117,-2.6510747999438919]
["2014-02-01",12275,12092,-0.94226092211876422,-0.99766876919054415,-1.9399296913093083,-0.50802236462017625,-2.2261007823972356,-2.7341231470174119]
["2014-02-02",12276,12093,-0.99766876919056346,-0.97908408768229427,-1.9767528568728578,-0.31509514290798613,-2.3031285834284452,-2.6182237263364314]
["2014-02-03",12277,12094,-0.97908408768242183,-0.88788521840248824,-1.86696930608491,-8.5558235263956395E-2,-2.2247396426441917,-2.3102978779081482]
["2014-02-04",12278,12095,-0.88788521840235834,-0.73083596427824515,-1.6187211826806034,0.16832434318657796,-1.9994694578338845,-1.8311451146473066]
["2014-02-05",12279,12096,-0.73083596427805253,-0.51958395003552682,-1.2504199143135795,0.43161184472332087,-1.6456444323789425,-1.2140325876556217]
["2014-02-06",12280,12097,-0.51958395003567415,-0.26979677115750145,-0.78938072119317559,0.68766783862430847,-1.1900494648580815,-0.50238162623377303]
["2014-02-07",12281,12098,-0.26979677115722966,-4.273135664756289E-13,-0.26979677115765699,0.91931610746265591,-0.66602892120531632,0.25328718625733959]
["2014-02-08",12282,12099,-1.4505670969944262E-13,0.26979677115711642,0.26979677115697137,1.1100877636150237,-0.11115288850302951,0.99893487511199419]
["2014-02-09",12283,12100,0.26979677115651246,0.51958395003557367,0.78938072119208613,1.2454665240437812,0.43539002871932464,1.6808565527631059]
["2014-02-10",12284,12101,0.51958395003503777,0.73083596427797226,1.2504199143130101,1.3140366198122393,0.93549390063058713,2.2495305204428266]
["2014-02-11",12285,12102,0.73083596427816488,0.88788521840230428,1.6187211826804693,1.308442658451586,1.3547453628047128,2.6631880212562988]
["2014-02-12",12286,12103,0.88788521840243417,0.97908408768230537,1.8669693060847394,1.2260826776200102,1.6647638544281158,2.8908465320481262]
["2014-02-13",12287,12104,0.97908408768227029,0.99766876919057146,1.9767528568728419,1.069473857128763,1.8451130385506711,2.9145868956794341]
["2014-02-14",12288,12105,0.99766876919055214,0.94226092211880352,1.9399296913093558,0.84625362751274202,1.8846543109618499,2.730907938474592]
["2014-02-15",12289,12106,0.94226092211886137,0.81696989301037348,1.7592308151292348,0.56880555379599818,1.7822521518562959,2.3510577056522939]
["2014-02-16",12290,12107,0.81696989301073519,0.63108794432626047,1.4480578373369957,0.25352742332855271,1.5467859854319044,1.8003134087604571]
["2014-02-17",12291,12108,0.63108794432604154,0.39840108984642436,1.0294890341724658,-8.021367556489889E-2,1.1964710639748257,1.1162573884099269]
["2014-02-18",12292,12109,0.39840108984616551,0.13616664909637655,0.53456773894254206,-0.41136991931608202,0.75753837016838721,0.34616845085230519]
["2014-02-19",12293,12110,0.13616664909609691,-0.13616664909618428,-8.737455203799982E-14,-0.7186557109803049,0.26236735883570517,-0.45628835214459973]
["2014-02-20",12294,12111,-0.13616664909601339,-0.39840108984582928,-0.53456773894184262,-0.98204219524796099,-0.25279747111758849,-1.2348396663655494]
["2014-02-21",12295,12112,-0.39840108984608819,-0.63108794432610993,-1.0294890341721981,-1.184194326009715,-0.7503872055189954,-1.9345815315287105]
["2014-02-22",12296,12113,-0.63108794432597615,-0.81696989301052381,-1.4480578373365001,-1.3117433735802257,-1.1941304727732589,-2.5058738463534844]
["2014-02-23",12297,12114,-0.8169698930101621,-0.94226092211873858,-1.7592308151289007,-1.3562977053908769,-1.5515761398154604,-2.9078738452063373]
["2014-02-24",12298,12115,-0.94226092211883306,-0.99766876919052716,-1.9399296913093602,-1.3151120878230844,-1.7963438779032646,-3.111455965726349]
["2014-02-25",12299,12116,-0.99766876919054648,-0.97908408768234489,-1.9767528568728914,-1.1913594750701222,-1.9099492905894939,-3.1013087656596161]

{"sheet":"Eesti","index":6,"n_rows":31,"n_cols":10,"rows_kept":31,"cut":false,"hidden":false,"merged":[[28,3,28,6],[29,2,29,7],[30,3,30,6],[24,3,24,6],[25,2,25,7],[26,3,26,6],[27,2,27,7],[22,3,22,6],[23,2,23,7],[18,3,18,6],[19,2,19,7],[20,3,20,6],[21,2,21,7],[3,2,3,7],[15,2,15,7],[16,3,16,6],[17,2,17,7],[4,3,4,6],[5,2,5,7],[6,3,6,6],[7,2,7,7],[12,3,12,6],[13,2,13,7],[14,3,14,6],[8,3,8,6],[9,2,9,7],[10,3,10,6],[11,2,11,7]]}
[]
[null,null,"Viktoriin \"Meie kodumaa\" ",null,null,null,null,{"$f":"SUM(H5:H184)","v":4}]
[null,null,null,"Sisesta sinistesse lahtritesse vastused"]
[null,"1.","Mis on Eesti presidendi perekonnanimi?"]
[null,null,null,"Ilves",null,null,null,{"$f":"IF(D5<>\"\",IF(D5=I5,2,0),\"\")","v":2},"Ilves"]
[null,"2.","Mis on Eesti esimese naisluuletaja perekonnanimi?"]
[null,null,null,"Koidula",null,null,null,{"$f":"IF(D7<>\"\",IF(D7=I7,2,0),\"\")","v":2},"Koidula"]
[null,"3.","Mis oli Eesti esimese presidendi perekonnanimi?"]
[null,null,null,null,null,null,null,{"$f":"IF(D9<>\"\",IF(D9=I9,2,0),\"\")","v":""},"Päts"]
[null,"4.","Koht, kus asub presidendi loss? "]
[null,null,null,null,null,null,null,{"$f":"IF(D11<>\"\",IF(OR(D11=I11,D11=J11),2,0),\"\")","v":""},"Kadriorg","Tallinnas"]
[null,"5.","Koht, kus on Kalevi haud?"]
[null,null,null,null,null,null,null,{"$f":"IF(D13<>\"\",IF(D13=I13,2,0),\"\")","v":""},"Toompea"]
[null,"6.","Mis järv tekkis Linda pisaratest?"]
[null,null,null,null,null,null,null,{"$f":"IF(D15<>\"\",IF(D15=I15,2,0),\"\")","v":""},"Ülemiste"]
[null,"7.","Mis on Eesti rahvuslind?"]
[null,null,null,null,null,null,null,{"$f":"IF(D17<>\"\",IF(D17=I17,2,0),\"\")","v":""},"suitsupääsuke"]
[null,"8.","Mis on Eesti rahvuslill?"]
[null,null,null,null,null,null,null,{"$f":"IF(D19<>\"\",IF(D19=I19,2,0),\"\")","v":""},"rukkilill"]
[null,"9.","Mis on Eesti rahvuskivi?"]
[null,null,null,null,null,null,null,{"$f":"IF(D21<>\"\",IF(D21=I21,2,0),\"\")","v":""},"paekivi"]
[null,"10.","Mis on Kalevipoja nimi?"]
[null,null,null,null,null,null,null,{"$f":"IF(D23<>\"\",IF(D23=I23,2,0),\"\")","v":""},"ei tea"]
[null,"11.","Kes on Eesti põhjanaaber?"]
[null,null,null,null,null,null,null,{"$f":"IF(D25<>\"\",IF(D25=I25,2,0),\"\")","v":""},"Soome"]
[null,"12.","Kes on Eesti lõunanaaber?"]
[null,null,null,null,null,null,null,{"$f":"IF(D27<>\"\",IF(D27=I27,2,0),\"\")","v":""},"Läti"]
[null,"13.","Kes on Eesti idanaaber?"]
[null,null,null,null,null,null,null,{"$f":"IF(D29<>\"\",IF(D29=I29,2,0),\"\")","v":""},"Venemaa"]
[null,"14.","Mitu linna on Eestis?"]
[null,null,null,null,null,null,null,{"$f":"IF(D31<>\"\",IF(D31=I31,2,0),\"\")","v":""},33]

{"sheet":"abi","index":7,"n_rows":18,"n_cols":7,"rows_kept":18,"cut":false,"hidden":false,"merged":[]}
[]
[null,"rütmid","jagajad","lühendid",null,"k","ky"]
[null,"emotsionaalne",28,"E",null,{"$f":"IF(K_rütm=\"\",0,1)","v":1},{"$f":"IF(valik=TRUE,1,0)","v":1}]
[null,"füüsiline",23,"F"]
[null,"intelektuaalne",33,"I"]
[null,"sotsiaalne",25,"S"]
[null,null,1,1]
[]
[null,{"$f":"K_rütm","v":"füüsiline"},{"$f":"IF(K_rütm=\"\",1,LOOKUP(B9,rütmid,jagajad))","v":23},{"$f":"IF(K_rütm=\"\",\"\",LOOKUP(B9,rütmid,lühendid))","v":"F"}]
[]
[]
[]
[]
[null,"r_ind","r_mees","r_naine","r_tekst"]
[null,0,-50,-50,"kondibukett"]
[null,18,-10,5,"normaalne"]
[null,25,23,38,"ülekaal"]
[null,30,32,50,"paksuke"]

{"sheet":"tabelid","index":8,"n_rows":16,"n_cols":8,"rows_kept":16,"cut":false,"hidden":false,"merged":[]}
[]
[null,null,"Tähtkujud",null,null,null,"Aastad idamaa kalendris"]
[null,"Nr","Algus","Kuju","Sümbol",null,"nr","Aasta nimeus"]
[null,0,"1999-01-01","Kaljukits","g",null,0,"sea"]
[null,1,"1999-01-20","Veevalaja","h",null,1,"roti"]
[null,2,"1999-02-19","Kalad","i",null,2,"härja"]
[null,3,"1999-03-21","Jäär","^",null,3,"tiigri"]
[null,4,"1999-04-20","Sõnn","_",null,4,"jänese"]
[null,5,"1999-05-21","Kaksikud","`",null,5,"draakoni"]
[null,6,"1999-06-22","Vähk","a",null,6,"mao"]
[null,7,"1999-07-23","Lõvi","b",null,7,"hobuse"]
[null,8,"1999-08-23","Neitsi","c",null,8,"siku"]
[null,9,"1999-09-23","Kaalud","d",null,9,"ahvi"]
[null,10,"1999-10-23","Skorpion","e",null,10,"kuke"]
[null,11,"1999-11-23","Ambur","f",null,11,"koera"]
[null,12,"1999-12-22","Kaljukits","g"]