{"text_format":"1","workbook":"xlsx","n_sheets":30,"sheets":["Start","Sisukord","Loendid","A_müügid","Töötajad","Filter_AT","Rist_T1","P_Müügid","Filter_PM1","Filter_PM2","Rist_PM","SumIF_PM","Sort","Päringud","Autofilter","Auto_AM","Aren_Filter","Filter_AM","Filter_PM_D","Kokku","Vahekokku","Risttabelid","Rist_A1","Rist_A2","SumIF","Sheet2","SumIF (2)","Sum_IF_AM","D_Fumkts","P_abi"],"not_rendered":{"charts":0,"images":6,"macros":1,"external_links":1,"defined_names":127,"comments":14,"pivot_tables":10},"unopened":[],"bounds":{"document_bytes":16777216,"sheet_cells":100000,"rows_first":2000,"rows_last":500,"rows_between":2000,"halvings":0,"cell_chars":16384,"cell_head_chars":4096},"cells_cut":0,"cells_raw":0,"read":"whole","date_system":"1900"}

{"sheet":"Start","index":0,"n_rows":15,"n_cols":4,"rows_kept":15,"cut":false,"hidden":false,"merged":[]}
[]
[]
[]
[]
[]
[]
[]
[]
[]
[]
{"$rows_left_out":6}
{"sheet":"Sisukord","index":1,"n_rows":17,"n_cols":2,"rows_kept":17,"cut":false,"hidden":false,"merged":[]}
[]
[]
[]
[null,"Andmeloendite  põhiomadused ja põhitegevused nendega"]
[null,"Arvutite müükide arvestus"]
[null,"Töötajate nimekiri"]
[null,"Puidu müükide tabel"]
[null,"Tabeli kirjete sorteerimine ja grupeerimine"]
[null,"Päringud ja filtreerimine"]
[null,"Autofilter"]
{"$rows_left_out":8}
{"sheet":"Loendid","index":2,"n_rows":19,"n_cols":13,"rows_kept":19,"cut":false,"hidden":false,"merged":[]}
[]
[]
["Andmeloendite  põhiomadused ja põhitegevused nendega"]
[null,null,null,null,null,null,null,"Arvutid"]
[]
[null,null,null,null,null,null,null,"Mark","Protsessori\ntüüp","Takt-\nsagedus","Põhimälu\nmaht","Kõvaketta\nmaht","Hind"]
[null,null,null,null,null,null,null,"Aragorn","AMD Athlon64",3,512,160,499]
[null,null,null,null,null,null,null,"Arven","Intel Core 2",2.6,256,200,369]
[null,null,null,null,null,null,null,"Balrog","Intel Celeron",2.8,256,80,419]
[null,null,null,null,null,null,null,"Eldar","Intel Xeon",3,512,160,465]
{"$rows_left_out":10}
{"sheet":"A_müügid","index":3,"n_rows":41,"n_cols":7,"rows_kept":41,"cut":false,"hidden":false,"merged":[]}
[]
[]
[null,"Arvutite müükide arvestus",null,null,null,"arvutid"]
[]
[null,null,null,"Kokku",{"$f":"SUM(Arv)","v":90},null,{"$f":"SUM(Maksumus)","v":62999}]
[]
[null,"Kuupäev","Linn","Arvuti","Arv","Hind","Maksumus"]
[null,"2013-01-02","Tallinn","Frodo",2,{"$f":"VLOOKUP(Arvuti, Arvutid, 6, 0)","v":1330},{"$f":"Hind * Arv","v":2660}]
[null,"2013-01-02","Valga","Balrog",1,419,419]
[null,"2013-01-03","Võru","Gandalf",2,849,1698]
{"$rows_left_out":32}
{"sheet":"Töötajad","index":4,"n_rows":105,"n_cols":14,"rows_kept":105,"cut":false,"hidden":false,"merged":[]}
[null,null,null,"aa"]
[null,null,null,{"$f":"J7 > AVERAGE(Palk)","v":false},null,{"$f":"AVERAGE(Palk)","v":1181.3030303030303},"Sugu","Palk","Vanus",null,"Osakond","Sugu",null,"Amet"]
[null,"Töötajad",null,null,null,null,"mees","<1000",">50",null,"Ost","naine"]
[null,"sortimine","autofilter","arend. filter","vahe","risttabel",null,null,null,null,"Ladu","naine"]
[null,null,null,null,null,null,null,null,null,null,null,null,null,"Amet"]
[null,"Isikukood","Eesnimi","Perenimi","Sugu","Sünniaeg","Vanus","Osakond","Amet","Palk",null,null,null,"tööline"]
[null,38502110722,"Karl","Agur","mees",{"$f":"DATE(MID(B7,2,2),MID(B7,4,2),MID(B7,6,2))","v":"1985-02-11"},{"$f":"INT((TODAY()-F7)/365.25)","v":28},"Tootmine","tööline",720,null,null,null,"sekretär"]
[null,48704250911,"Helen","Aigro","naine","1987-04-25",26,"Müük","sekretär",850,null,null,null,"lukksepp"]
[null,"36405130719","Erki","Ainsaar","mees","1964-05-13",49,"Tootmine","lukksepp",1150,null,null,null,"sekretäär"]
[null,"46605150941","Maarja","Ambros","naine","1966-05-15",47,"Ost","sekretäär",850,null,null,null,"kompekteerija"]
{"$rows_left_out":96}
{"sheet":"Filter_AT","index":5,"n_rows":92,"n_cols":10,"rows_kept":92,"cut":false,"hidden":false,"merged":[]}
[]
[]
[null," - kirjed, kus Sugu on mees, Vanus suurem kui 50 ja Palk  väiksem kui 10000"]
[null,"Isikukood","Eesnimi","Perenimi","Sugu","Sünniaeg","Vanus","Osakond","Amet","Palk"]
[null,"34404190222","Kaivo","Berk","mees","1944-04-19",63,"Ladu","tööline",7600]
[null,"33904050217","Olav","Berk","mees","1939-04-05",68,"Tootmine","tööline",8700]
[null,"35105180673","Eino","Luige","mees","1951-05-18",56,"Tootmine","tööline",7600]
[null,"34506190557","Reijo","Meigas","mees","1945-06-19",62,"Ladu","tööline",9600]
[null,"35408240148","Arnold","Merilaid","mees","1954-08-24",53,"Transport","autojuht",9400]
[null,"34204170615","Aadu","Pulk","mees","1942-04-17",65,"Transport","valvur",6700]
{"$rows_left_out":83}
{"sheet":"Rist_T1","index":6,"n_rows":47,"n_cols":5,"rows_kept":47,"cut":false,"hidden":false,"merged":[]}
[]
[]
[null,"Sum of Palk"]
[null,"Osakond","Total"]
[null,"Finants",152840]
[null,"Ladu",105100]
[null,"Majandus",70500]
[null,"Müük",180100]
[null,"Ost",68700]
[null,"Tootmine",431950]
{"$rows_left_out":38}
{"sheet":"P_Müügid","index":7,"n_rows":437,"n_cols":12,"rows_kept":437,"cut":false,"hidden":false,"merged":[]}
[]
[null,"Puidu müük",null,"AS Karu & Pojad",null,null,null,{"$f":"YEAR(C9)","v":2007},null,null,"P-abi"]
[]
[null,"sortimine","autofilter","arend. filter","vahe","risttabel","SumIF"]
[]
[null,null,null,null,null,null,"Kokku",null,{"$f":"SUM(P_kogus)","v":17099},null,{"$f":"SUM(P_maks)","v":11201965}]
[]
[null,"P_arve","P_kuupäev","P_ostja","P_maa","P_liik","P_sort","P_müüja","P_kogus","P_hind","P_maks","P_kuu"]
[null,"P001","2007-01-02","Seen",{"$f":"VLOOKUP(P_ostja, o_tab, 2, 0)","v":"Võru"},"mänd",2,"Siil",28,{"$f":"VLOOKUP(P_liik, P_hinnad, P_sort+1, 0)","v":675},{"$f":"P_hind * P_kogus","v":18900},{"$f":"MONTH(P_kuupäev)","v":1}]
[null,"P002","2007-01-03","Haab","Pärnu","kask",1,"Karu",75,700,52500,1]
{"$rows_left_out":428}
{"sheet":"Filter_PM1","index":8,"n_rows":43,"n_cols":17,"rows_kept":43,"cut":false,"hidden":false,"merged":[]}
[]
[null,"P_arve","P_kuupäev","P_ostja","P_maa","P_liik","P_sort","P_müüja","P_kogus","P_hind","P_maks","P_kuu",null,"P_maa","P_ostja","P_liik","P_müüja"]
[]
[null," Etteantud kuu kirjed. Kriteeriumis  kasutatakse valideerimist"]
[null,"P_kuu",null,null,null,null,null,null,null,null,null,null,null,"P_maa","P_ostja","P_liik","P_müüja"]
[null,12,null,null,null,null,null,null,null,null,null,null,null,"Võru","Seen","mänd","Siil"]
[null,null,null,null,null,null,null,null,null,null,null,null,null,"Pärnu","Haab","kask","Karu"]
[null,"P_arve","P_kuupäev","P_ostja","P_maa","P_liik","P_sort","P_müüja","P_kogus","P_hind","P_maks","P_kuu",null,"Lääne","Karu","vaher","Põder"]
[null,"P273","2007-12-01","Tuvi","Harju","kask",2,"Karu",48,630,30240,12,null,"Valga","Juur","lepp","Rebane"]
[null,"P274","2007-12-01","Varblane","Harju","lepp",1,"Siil",67,650,43550,12,null,"Rapla","Lind","küte","Jänes"]
{"$rows_left_out":34}
{"sheet":"Filter_PM2","index":9,"n_rows":29,"n_cols":13,"rows_kept":29,"cut":false,"hidden":false,"merged":[]}
[]
[null,"P_arve","P_kuupäev","P_ostja","P_maa","P_liik","P_sort","P_müüja","P_kogus","P_hind","P_maks","P_kuu"]
[]
[]
[null,"Väljad kuupäev, arve, müüja, ostja, kogus ja maksumus etteantud maakonna ja puu liigi jaoks "]
[null,"P_maa","P_liik",null,null,null,null,null,null,"P_liik","P_kuupäev","P_kuupäev"]
[null,"Pärnu","küte",null,null,null,null,null,null,"mänd",">=1.01.2007","<=31.03.2007"]
[]
[null,"P_kuupäev","P_arve","P_müüja","P_ostja","P_kogus","P_maks",null,null,null,"Kokku",{"$f":"SUM(L12:L112)","v":649},{"$f":"SUM(M12:M112)","v":460575}]
[null,"2007-01-23","P020","Põder","Kaun",48,22560]
{"$rows_left_out":20}
{"sheet":"Rist_PM","index":10,"n_rows":33,"n_cols":12,"rows_kept":33,"cut":false,"hidden":false,"merged":[]}
[]
[null," Puidu maksumus maakondade (read) ja liikide (veerud) lõikes"]
[null,"Sum of P_maks","P_liik"]
[null,"P_maa","haab","kask","kuusk","küte","lepp","mänd","saar","tamm","vaher","Grand Total"]
[null,"Harju",173600,288680,379840,117406,223340,497700,314500,115610,51300,2161976]
[null,"Lääne",56300,329700,191120,121448,279760,304800,221170,51590,124830,1680718]
[null,"Paide",33750,34720,54400,74918,60125,292725,99280,51370,49400,750688]
[null,"Pärnu",224050,204890,336960,165863,329160,387600,110075,353870,119985,2232453]
[null,"Rapla",45000,113820,161760,55225,163085,97050,82960,88000,17100,824000]
[null,"Valga",69300,66990,273680,158484,167830,260100,105485,40700,27360,1169929]
{"$rows_left_out":24}
{"sheet":"SumIF_PM","index":11,"n_rows":25,"n_cols":5,"rows_kept":25,"cut":false,"hidden":false,"merged":[]}
[]
[]
[null,"Maakond","Kogus","Maksumus"]
[null,"Harju",{"$f":"SUMIF(P_maa, Maakond, P_kogus)","v":3237},{"$f":"SUMIF(P_maa, Maakond, P_maks)","v":2161976}]
[null,"Lääne",2508,1680718]
[null,"Paide",1146,750688]
[null,"Pärnu",3365,2232453]
[null,"Rapla",1254,824000]
[null,"Valga",1818,1169929]
[null,"Viljandi",1991,1238391]
{"$rows_left_out":16}
{"sheet":"Sort","index":12,"n_rows":40,"n_cols":14,"rows_kept":40,"cut":false,"hidden":false,"merged":[[0,9,0,10]]}
[null,null,null,null,null,null,null,null,null,"Harjutustabelid"]
[null,null,null,null,null,null,null,null,null,"Töötajad","Puidu müük"]
[]
[null,null,null,null,null,null,null,null,"Arvutite müükide arvestus"]
[]
[null,null,null,null,null,null,null,null,"Kuupäev","Linn","Arvuti","Arv","Hind","Maksumus"]
[null,null,null,null,null,null,null,null,"2007-01-02","Tallinn","Frodo",2,{"$f":"VLOOKUP(Arvuti, Arvutid, 6, 0)","v":1330},{"$f":"Hind * Arv","v":2660}]
[null,null,null,null,null,null,null,null,"2007-01-02","Valga","Balrog",1,419,419]
[null,null,null,null,null,null,null,null,"2007-01-03","Tallinn","Aragorn",2,499,998]
[null,null,null,null,null,null,null,null,"2007-01-03","Tallinn","Balrog",3,419,1257]
{"$rows_left_out":31}
{"sheet":"Päringud","index":13,"n_rows":0,"n_cols":0,"rows_kept":0,"cut":false,"hidden":false,"merged":[]}

{"sheet":"Autofilter","index":14,"n_rows":40,"n_cols":14,"rows_kept":40,"cut":false,"hidden":false,"merged":[[0,8,0,9]]}
[null,null,null,null,null,null,null,null,"Harjutustabelid"]
[null,null,null,null,null,null,null,null,"töötajad","puidu müük"]
[null,"AutoFilter - Data/Filter/AutoFilter"]
[null,null,null,null,null,null,null,null,"Arvutite müükide arvestus",null,null,{"$f":"SUBTOTAL(9, L7:L40)","v":90},{"$f":"SUBTOTAL(1, M7:M40)","v":7285},{"$f":"SUBTOTAL(9, N7:N40)","v":659230}]
[]
[null,null,null,null,null,null,null,null,"Kuupäev","Linn","Arvuti","Arv","Hind","Maksumus"]
[null,null,null,null,null,null,null,null,"2007-01-02","Valga","Balrog",1,4190,4190]
[null,null,null,null,null,null,null,null,"2007-01-03","Võru","Gandalf",2,8490,16980]
[null,null,null,null,null,null,null,null,"2007-01-03","Tallinn","Aragorn",2,4990,9980]
[null,null,null,null,null,null,null,null,"2007-01-03","Tallinn","Balrog",3,4190,12570]
{"$rows_left_out":31}
{"sheet":"Auto_AM","index":15,"n_rows":37,"n_cols":14,"rows_kept":37,"cut":false,"hidden":false,"merged":[]}
[]
[]
[null," arvuti on Balrog ",null,null,null,null,null,null,"müügid, kuus kuupäev on vahemikus 10.01.07 kuni 20.01.07"]
[null,"Kuupäev","Linn","Arvuti","Arv","Hind","Maksumus",null,"Kuupäev","Linn","Arvuti","Arv","Hind","Maksumus"]
[null,"2007-01-02","Valga","Balrog",1,4190,4190,null,"2007-01-10","Tartu","Sauron",2,3390,6780]
[null,"2007-01-03","Tallinn","Balrog",3,4190,12570,null,"2007-01-10","Pärnu","Elend",1,12990,12990]
[null,"2007-01-11","Tartu","Balrog",2,4190,8380,null,"2007-01-10","Pärnu","Rohan",4,5890,23560]
[null,"2007-01-17","Tallinn","Balrog",7,6990,48930,null,"2007-01-11","Tartu","Balrog",2,4190,8380]
[null,"2007-01-07","Valga","Balrog",6,4190,25140,null,"2007-01-11","Tallinn","Frodo",1,13300,13300]
[null,"2007-01-04","Tartu","Balrog",5,4190,20950,null,"2007-01-11","Valga","Aragorn",1,4990,4990]
{"$rows_left_out":28}
{"sheet":"Aren_Filter","index":16,"n_rows":40,"n_cols":14,"rows_kept":40,"cut":false,"hidden":false,"merged":[]}
[null,null,null,null,null,null,null,null,null,"Harjutustabelid:"]
[null,null,null,null,null,null,null,null,null,"Töötajad","Puidu müük"]
[]
[null,null,null,null,null,null,null,null,"Arvutite müükide arvestus"]
[]
[null,null,null,null,null,null,null,null,"Kuupäev","Linn","Arvuti","Arv","Hind","Maksumus"]
[null,null,null,null,null,null,null,null,"2007-01-02","Tallinn","Frodo",2,13300,26600]
[null,null,null,null,null,null,null,null,"2007-01-02","Valga","Balrog",1,4190,4190]
[null,null,null,null,null,null,null,null,"2007-01-03","Võru","Gandalf",2,8490,16980]
[null,null,null,null,null,null,null,null,"2007-01-03","Tallinn","Balrog",3,4190,12570]
{"$rows_left_out":31}
{"sheet":"Filter_AM","index":17,"n_rows":37,"n_cols":12,"rows_kept":37,"cut":false,"hidden":false,"merged":[]}
[]
[]
[null,"Kuupäev","Linn","Arvuti","Arv","Hind","Maksumus"]
[null,null,null,null,null,null,null,null,null,"Väljad Kuupäev, Linn, Arv kirjetest, kus Arvuti on Frodo ja "]
[null," kirjed, kus linn on Tallinn või Tartu",null,null,null,null,null,null,null,"      Kuupäev on vahemikus 01.01.07 kuni 15.01.07"]
[null,"Linn",null,null,null,null,null,null,null,"Arvuti","Kuupäev","Kuupäev"]
[null,"Tallinn",null,null,null,null,null,null,null,"Frodo",">=01.01.07","<=15.01.07"]
[null,"Tartu"]
[null,null,null,"Kokku",{"$f":"SUM(E12:E29)","v":53},null,{"$f":"SUM(G12:G29)","v":400850},null,null,"Kuupäev","Linn","Arv"]
[null,null,null,null,null,null,null,null,null,"2007-01-02","Tallinn",2]
{"$rows_left_out":28}
{"sheet":"Filter_PM_D","index":18,"n_rows":23,"n_cols":11,"rows_kept":23,"cut":false,"hidden":false,"merged":[]}
[]
[null,"Demo. Demo. Demo "]
[null,"Puidu müük. Väljavõtete tegemine maakondade ja puidu liikide lõikes"]
[]
[null,"Maakond","puidu liik",null,null,null,null,null,null,{"$f":"DSUM(PM, \"P_kogus\", Kriteerium)","v":474},{"$f":"DSUM(PM, \"P_maks\",Kriteerium)","v":336960}]
[null,"P_maa","P_liik"]
[null,"Pärnu","kuusk"]
[]
[null,null,null,null,"Kokku:",{"$f":"SUM(F13:F203)","v":474},{"$f":"SUM(G13:G203)","v":336960}]
[]
{"$rows_left_out":14}
{"sheet":"Kokku","index":19,"n_rows":0,"n_cols":0,"rows_kept":0,"cut":false,"hidden":false,"merged":[]}

{"sheet":"Vahekokku","index":20,"n_rows":40,"n_cols":14,"rows_kept":40,"cut":false,"hidden":false,"merged":[[0,9,0,10]]}
[null,null,null,null,null,null,null,null,null,"Harjutustabelid"]
[null,null,null,null,null,null,null,null,null,"töötajad","puidu müük"]
[]
[null,null,null,null,null,null,null,null,"Arvutite müükide arvestus"]
[]
[null,null,null,null,null,null,null,null,"Kuupäev","Linn","Arvuti","Arv","Hind","Maksumus"]
[null,null,null,null,null,null,null,null,"2007-01-21","Pärnu","Arven",1,3690,3690]
[null,null,null,null,null,null,null,null,"2007-01-07","Pärnu","Eldar",3,4650,13950]
[null,null,null,null,null,null,null,null,"2007-01-18","Pärnu","Eldar",1,4650,4650]
[null,null,null,null,null,null,null,null,"2007-01-10","Pärnu","Elend",1,12990,12990]
{"$rows_left_out":31}
{"sheet":"Risttabelid","index":21,"n_rows":40,"n_cols":14,"rows_kept":40,"cut":false,"hidden":false,"merged":[]}
[null,null,null,null,null,null,null,null,null,"Harjutustabelid:"]
[null,null,null,null,null,null,null,null,null,"Töötajad","Puidu müük"]
[]
[null,null,null,null,null,null,null,null,"Arvutite müükide arvestus"]
[]
[null,null,null,null,null,null,null,null,"Kuupäev","Linn","Arvuti","Arv","Hind","Maksumus"]
[null,null,null,null,null,null,null,null,"2007-01-02","Valga","Balrog",1,4190,4190]
[null,null,null,null,null,null,null,null,"2007-01-03","Võru","Gandalf",2,8490,16980]
[null,null,null,null,null,null,null,null,"2007-01-03","Tallinn","Aragorn",2,4990,9980]
[null,null,null,null,null,null,null,null,"2007-01-03","Tallinn","Balrog",3,4190,12570]
{"$rows_left_out":31}
{"sheet":"Rist_A1","index":22,"n_rows":48,"n_cols":3,"rows_kept":48,"cut":false,"hidden":false,"merged":[]}
[]
[]
[null,"Sum of Maksumus"]
[null,"Linn","Total"]
[null,"Pärnu",101290]
[null,"Tallinn",289580]
[null,"Tartu",111270]
[null,"Valga",61600]
[null,"Võru",95490]
[null,"Grand Total",659230]
{"$rows_left_out":39}
{"sheet":"Rist_A2","index":23,"n_rows":35,"n_cols":8,"rows_kept":35,"cut":false,"hidden":false,"merged":[]}
[]
[]
[null,null,"Data"]
[null,"Arvuti","Sum of Arv","Sum of Maksumus"]
[null,"Aragorn",7,34930]
[null,"Arven",6,22140]
[null,"Balrog",24,120160]
[null,"Eldar",7,32550]
[null,"Elend",8,103920]
[null,"Faram",1,5990]
{"$rows_left_out":26}
{"sheet":"SumIF","index":24,"n_rows":39,"n_cols":16,"rows_kept":39,"cut":false,"hidden":false,"merged":[]}
[null,null,null,null,null,null,null,null,null,"Harjutustabel",null,"Puidu müük"]
[]
[null,"Funktsioonid COUNTIF ja SUMIF ",null,null,null,null,null,null,null,"Arvutite müükide arvestus"]
[]
[null,null,null,null,null,null,null,null,null,"A_Kuupäev","A_Linn","A_Arvuti","A_Arv","A_Hind","A_Maksumus","Prots"]
[null,null,null,null,null,null,null,null,null,"2007-01-02","Tallinn","Frodo",2,13300,26600,{"$f":"VLOOKUP(L6, Arvutid,2,0)","v":"AMD Athlon64"}]
[null,null,null,null,null,null,null,null,null,"2007-01-02","Valga","Balrog",1,4190,4190,"Intel Celeron"]
[null,null,null,null,null,null,null,null,null,"2007-01-03","Tallinn","Aragorn",2,4990,9980,"AMD Athlon64"]
[null,null,null,null,null,null,null,null,null,"2007-01-03","Tallinn","Balrog",3,4190,12570,"Intel Celeron"]
[null,null,null,null,null,null,null,null,null,"2007-01-03","Võru","Gandalf",2,8490,16980,"Intel Xeon"]
{"$rows_left_out":30}
{"sheet":"Sheet2","index":25,"n_rows":36,"n_cols":16,"rows_kept":36,"cut":false,"hidden":false,"merged":[]}
[]
[]
[null,null,"suurem","kesk",null,"tt",null,"Prots"]
[null,null,{"$f":"SumIF!N6>kesk","v":true},{"$f":"AVERAGE(A_Hind)","v":7285},null,{"$f":"VLOOKUP(SumIF!L6, Arvutid, 2,0) = prots","v":false},null,"Intel Xeon"]
[]
[]
[]
[]
[null,null,"A_Kuupäev","A_Linn","A_Arvuti","A_Arv","A_Hind","A_Maksumus",null,"A_Kuupäev","A_Linn","A_Arvuti","A_Arv","A_Hind","A_Maksumus","Prots"]
[null,null,"2007-01-02","Tallinn","Frodo",2,13300,26600,null,"2007-01-03","Võru","Gandalf",2,8490,16980,"Intel Xeon"]
{"$rows_left_out":27}
{"sheet":"SumIF (2)","index":26,"n_rows":43,"n_cols":15,"rows_kept":43,"cut":false,"hidden":false,"merged":[]}
[null,null,null,null,null,null,null,null,null,"Harjutustabel",null,"Puidu müük"]
[null,null,null,null,null,null,null,null,null,"üle",null,null,null,null,"kesk"]
[null,null,null,null,null,null,null,null,null,{"$f":"N10>$O$3","v":true},null,null,null,null,{"$f":"AVERAGE(A_Hind)","v":7285}]
[]
[]
[]
[null,"Funktsioonid COUNTIF ja SUMIF ",null,null,null,null,null,null,null,"Arvutite müükide arvestus"]
[]
[null,null,null,null,null,null,null,null,null,"A_Kuupäev","A_Linn","A_Arvuti","A_Arv","A_Hind","A_Maksumus"]
[null,null,null,null,null,null,null,null,null,"2007-01-02","Tallinn","Frodo",2,13300,26600]
{"$rows_left_out":34}
{"sheet":"Sum_IF_AM","index":27,"n_rows":66,"n_cols":4,"rows_kept":66,"cut":false,"hidden":false,"merged":[]}
[]
[]
[null,"Koond linnade lõikes"]
[]
[null,"Linn","Arv","Maksumus"]
[null,"Tallinn",{"$f":"SUMIF(A_Linn, Linn, A_Arv)","v":36},{"$f":"SUMIF(A_Linn, Linn, A_Maksumus)","v":289580}]
[null,"Tartu",{"$f":"SUMIF(A_Linn, Linn, A_Arv)","v":17},{"$f":"SUMIF(A_Linn, Linn, A_Maksumus)","v":111270}]
[null,"Pärnu",{"$f":"SUMIF(A_Linn, Linn, A_Arv)","v":15},{"$f":"SUMIF(A_Linn, Linn, A_Maksumus)","v":101290}]
[null,"Valga",{"$f":"SUMIF(A_Linn, Linn, A_Arv)","v":11},{"$f":"SUMIF(A_Linn, Linn, A_Maksumus)","v":61600}]
[null,"Võru",{"$f":"SUMIF(A_Linn, Linn, A_Arv)","v":11},{"$f":"SUMIF(A_Linn, Linn, A_Maksumus)","v":95490}]
{"$rows_left_out":57}
{"sheet":"D_Fumkts","index":28,"n_rows":41,"n_cols":14,"rows_kept":41,"cut":false,"hidden":false,"merged":[]}
[]
[]
[]
[]
[null,null,null,null,null,null,null,null,"Müükide arvestus",null,null,{"$f":"SUBTOTAL(9, L8:L42)","v":90},null,{"$f":"SUBTOTAL(9, N8:N42)","v":659230}]
[]
[null,null,null,null,null,null,null,null,"Kuupäev","Linn","Arvuti","Arv","Hind","Maksumus"]
[null,null,null,null,null,null,null,null,"2007-01-02","Tallinn","Frodo",2,13300,26600]
[null,null,null,null,null,null,null,null,"2007-01-02","Valga","Balrog",1,4190,4190]
[null,null,null,null,null,null,null,null,"2007-01-03","Tallinn","Aragorn",2,4990,9980]
{"$rows_left_out":32}
{"sheet":"P_abi","index":29,"n_rows":53,"n_cols":5,"rows_kept":53,"cut":false,"hidden":false,"merged":[[3,1,4,1],[3,2,3,4]]}
[]
[null,"Puidu hinnkiri"]
[]
[null,"Liik","Sort"]
[null,null,1,2,3]
[null,"haab",500,{"$f":"0.9*C6","v":450},{"$f":"0.8*C6","v":400}]
[null,"kask",700,630,560]
[null,"kuusk",800,720,640]
[null,"küte",470,423,376]
[null,"lepp",650,585,520]
{"$rows_left_out":43}