{"text_format":"1","workbook":"xlsx","n_sheets":41,"sheets":["Alg","Sisukord","Tab_Str","Tab_Str_1","Tab_Str_2","Aadressid","Laed_A","Värvid","Fun_XA","Fun_XY_A1","Kaubad_A","Nimed","Laed_N","Gra1","Table_1","Laed_N (2)","Laed_N (3)","Table_2_1","Table_2_2","Hinnakiri","Fun_tab1_N","Fun_tab2_NT","Värvimine_ÜP","Ruumid","Värvimine_tab","Fun_XY_N","Lisad","Valideerimine","abi","Table_obj","VLOOKUP","Diagr_1","Diagrammileht","Addr_R1C1","Kopeerimine","Lohista","Menüüd","Nupud","Ctrl_C_V","Sheet1","Sheet2"],"not_rendered":{"charts":11,"images":10,"macros":1,"external_links":0,"defined_names":182,"comments":15,"pivot_tables":0},"unopened":[{"sheet":"Gra1","index":13,"reason":"not_a_worksheet"},{"sheet":"Diagrammileht","index":32,"reason":"not_a_worksheet"}],"bounds":{"document_bytes":16777216,"sheet_cells":100000,"rows_first":2000,"rows_last":500,"rows_between":2000,"halvings":0,"cell_chars":16384,"cell_head_chars":4096},"cells_cut":0,"cells_raw":0,"read":"whole","date_system":"1900"}

{"sheet":"Alg","index":0,"n_rows":14,"n_cols":4,"rows_kept":14,"cut":false,"hidden":false,"merged":[]}
[]
[]
[]
[]
[]
[]
[]
[]
[null,null,null,"Tabelid I"]
[null,null,null,"Valemite kasutamine tabelites"]
{"$rows_left_out":5}
{"sheet":"Sisukord","index":1,"n_rows":27,"n_cols":2,"rows_kept":27,"cut":false,"hidden":false,"merged":[]}
[]
[]
[null,"Tabelite loomise ja kasutamise üldpõhimõtted"]
[null,"Aadresside kasutamine"]
[null,"Harjutus \"Lagede värvimine I\". Aadressid"]
[null,"Tabel Värvid"]
[null,"Ühemuutuja funktsiooni tabuleerimine ja graafikud. Aadressid"]
[null,"Kahemuutuja funktsioon. Aadressid"]
[null,"Kaubad"]
[null,"Nimede määramine  ja kasutamine tabelites"]
{"$rows_left_out":18}
{"sheet":"Tab_Str","index":2,"n_rows":112,"n_cols":9,"rows_kept":112,"cut":false,"hidden":false,"merged":[[0,4,0,6]]}
[null,null,null,"veeb","Klipp\nTabelite tüüpstruktuur"]
[]
[]
[]
[]
[]
[]
[]
[]
[]
{"$rows_left_out":103}
{"sheet":"Tab_Str_1","index":3,"n_rows":71,"n_cols":9,"rows_kept":71,"cut":false,"hidden":false,"merged":[[0,4,0,6]]}
[null,null,null,"veeb","Klipp\nTabelite tüüpstruktuur"]
[]
[]
[]
[]
[]
[]
[]
[]
[]
{"$rows_left_out":62}
{"sheet":"Tab_Str_2","index":4,"n_rows":71,"n_cols":9,"rows_kept":71,"cut":false,"hidden":false,"merged":[[0,4,0,6]]}
[null,null,null,"veeb","Klipp\nTabelite tüüpstruktuur"]
[]
[]
[]
[]
[]
[]
[]
[]
[]
{"$rows_left_out":62}
{"sheet":"Aadressid","index":5,"n_rows":33,"n_cols":12,"rows_kept":33,"cut":false,"hidden":false,"merged":[]}
[]
[]
[]
[]
[]
[]
[]
[]
[]
[null,"R1C1 - aadressid"]
{"$rows_left_out":24}
{"sheet":"Laed_A","index":6,"n_rows":21,"n_cols":9,"rows_kept":21,"cut":false,"hidden":false,"merged":[[0,5,0,6]]}
[null,null,null,"otsimine","valemite\nkopeerimine","Klipp \"Aadressid \nja nimed\"",null,"veeb"]
[]
[null,"Lagede värvimine I. Aadressid"]
[null,"Viitamine teise lehe lahtritele"]
[null,{"$f":"Aadressid!H13 + 100","v":113}]
[null,"värvi margi valimiseks dünaamiline kopeerimine"]
[null,"värv","hind, €/ltr","kulu, ltr/m2",null,"tariif, €/m2"]
[null,{"$f":"Värvid!B15","v":"VL_30"},{"$f":"VLOOKUP(B8, Värvid!B6:E16, 3, 0)","v":3},{"$f":"VLOOKUP(B8, Värvid!B6:E16, 2, 0)","v":0.47},null,1.2]
[]
[null,"ruum","pikkus","laius","pindala","värvi\nkogus","värvi\nmaksumus","tõõtasu","kulud kokku"]
{"$rows_left_out":12}
{"sheet":"Värvid","index":7,"n_rows":16,"n_cols":6,"rows_kept":16,"cut":false,"hidden":false,"merged":[]}
[]
[]
[null,"Värvid"]
[]
[null,"V_mark","kulu","hind","valmistaja","..."]
[null,"VL_01",0.52,3.05,"JukuColor"]
[null,"VL_02",0.48,3.37,"JukuColor"]
[null,"VL_05",0.65,4.0599999999999996,"Sadolin"]
[null,"VL_06",0.45,3.17,"JukuColor"]
[null,"VL_09",0.55000000000000004,4.0199999999999996,"JukuColor"]
{"$rows_left_out":7}
{"sheet":"Fun_XA","index":8,"n_rows":29,"n_cols":10,"rows_kept":29,"cut":false,"hidden":false,"merged":[]}
[]
[]
[null,"Funktsioonide tabuleerimine ja graafikud. Variant 1"]
[]
[null,"algus","lõpp","jaotisi","samm","p",null,"ymin","ymax","zkesk"]
[null,-10,10,20,{"$f":"(C6-B6)/D6","v":1},2,null,{"$f":"MIN(C9:C29)","v":-2.9383717218207628},{"$f":"MAX(C9:C29)","v":2.7278922804770449},{"$f":"AVERAGE(D9:D29)","v":-0.21100102233361015}]
[]
[null,"x","y","z"]
[null,{"$f":"B6","v":-10},{"$f":"3*SIN(B9+2)*COS(B9/2)","v":-0.84193056732976213},{"$f":"IF(B9<=$F$6, 5*COS(2*B9-3), 3*SIN(B9+1))","v":-2.6641651016669874}]
[null,{"$f":"B9+$E$6","v":-9},{"$f":"3*SIN(B10+2)*COS(B10/2)","v":0.41547004587670799},{"$f":"IF(B10<=$F$6, 5*COS(2*B10-3), 3*SIN(B10+1))","v":-2.7386463011213418}]
{"$rows_left_out":20}
{"sheet":"Fun_XY_A1","index":9,"n_rows":19,"n_cols":13,"rows_kept":19,"cut":false,"hidden":false,"merged":[]}
[]
[null,"Kahemuutuja funktsiooni tabel ja graafik. Aadressid. "]
[]
[null,"ax","bx","nx","hx","a","ay","by","ny","hy"]
[null,0,7,10,{"$f":"(C5-B5)/D5","v":0.7},5,0,14,10,{"$f":"(H5-G5)/I5","v":1.4}]
[]
[]
[null,null,{"$f":"B5","v":0},{"$f":"C8+$E$5","v":0.7},{"$f":"D8+$E$5","v":1.4},2.0999999999999996,2.8,3.5,4.2,4.9000000000000004,5.6000000000000005,6.3000000000000007,7.0000000000000009]
[null,{"$f":"G5","v":0},{"$f":"$F$5*SIN(C$8)*COS($B9)","v":0},{"$f":"$F$5*SIN(D$8)*COS($B9)","v":3.2210884361884551},4.9272486499423005,4.3160468332443696,1.6749407507795255,-1.7539161384480992,-4.357878862067941,-4.9122630631216619,-3.1563331893616042,8.4069502421753012E-2,3.2849329935939489]
[null,{"$f":"B9+$J$5","v":1.4},{"$f":"$F$5*SIN(C$8)*COS($B10)","v":0},0.54747919852795712,0.83747037538976266,0.73358614887017859,0.28468489393718061,-0.29810811493864703,-0.74069621929104157,-0.83492331801317532,-0.53647293423699738,1.4289053131670254E-2,0.55833067553989923]
{"$rows_left_out":10}
{"sheet":"Kaubad_A","index":10,"n_rows":45,"n_cols":7,"rows_kept":45,"cut":false,"hidden":false,"merged":[[3,3,3,5],[17,3,17,5],[32,3,32,5]]}
[null,null,null,"veeb"]
[null,"Kaupade allahindlus. Suht-, absoluut- ja sega-aadressid"]
[]
[null,null,null,"Allahinnatud",null,null,7.0000000000000007E-2]
[null,"Kaup","Alghind","Mai","Juuni","Juuli"]
[null,"Kaup1",1225,{"$f":"C6-C6*$G$4","v":1139.25},{"$f":"D6-D6*$G$4","v":1059.5025000000001},985.33732500000008]
[null,"Kaup2",500,{"$f":"C7-C7*$G$4","v":465},432.45,402.17849999999999]
[null,"Kaup3",869,808.17,751.59809999999993,698.98623299999997]
[null,"Kaup4",4589,4267.7700000000004,3969.0261000000005,3691.1942730000005]
[null,"Kaup5",12548,11669.64,10852.7652,10093.071636000001]
{"$rows_left_out":36}
{"sheet":"Nimed","index":11,"n_rows":25,"n_cols":14,"rows_kept":25,"cut":false,"hidden":false,"merged":[[0,4,0,5],[0,7,0,8]]}
[null,null,null,"veeb","Klipp \"Aadressid \nja nimed\"",null,"Klipp \" Nimede loomine\"","Klipp \"Nimede loomise ja kasutamise üldpõhimõtted\""]
[]
[]
[]
[]
[]
[]
[]
[]
[]
{"$rows_left_out":16}
{"sheet":"Laed_N","index":12,"n_rows":18,"n_cols":10,"rows_kept":18,"cut":false,"hidden":false,"merged":[[0,6,0,7],[2,4,2,5]]}
[null,null,null,"validee-\nrimine","otsimine","valemite\nkopeerimine","Klipp \"Aadressid \nja nimed\"",null,"Diagramm","veeb"]
[]
[null,"Lagede värvimine II. Nimed",null,null,"Diagrammid"]
[]
[null,"värv","hind, eu/ltr","kulu, ltr/m2",null,"tariif, eu/m2"]
[null,"VL_13",{"$f":"VLOOKUP(värv, Värvid[], 3, 0)","v":2.76},{"$f":"VLOOKUP(värv, Värvid[], 2, 0)","v":0.52},null,1.4]
[null,"värv","hind","kulu",null,"tariif"]
[]
[null,"ruum","pikkus","laius","pindala","v_kogus","v_maks","töötasu","Kokku"]
[null,"R_01",5,4,{"$f":"pikkus * laius","v":20},{"$f":"kulu * pindala","v":10.4},{"$f":"hind * v_kogus","v":28.703999999999997},{"$f":"tariif * pindala","v":28},{"$f":"v_maks + töötasu","v":56.703999999999994}]
{"$rows_left_out":9}
{"sheet":"Table_1","index":14,"n_rows":52,"n_cols":15,"rows_kept":52,"cut":false,"hidden":false,"merged":[[0,3,0,5]]}
[null,null,null,"Klipp \"Tabeli muutmine \nList-objektiks\""]
[]
[]
[]
[]
[]
[]
[]
[]
[]
{"$rows_left_out":43}
{"sheet":"Laed_N (2)","index":15,"n_rows":20,"n_cols":10,"rows_kept":20,"cut":false,"hidden":false,"merged":[[0,6,0,7],[2,4,2,5]]}
[null,null,null,"validee-\nrimine","otsimine","valemite\nkopeerimine","Klipp \"Aadressid \nja nimed\"",null,"Diagramm","veeb"]
[]
[null,"Lagede värvimine II. Nimed",null,null,"Diagrammid"]
[]
[null,"värv","hind, €/ltr","kulu, ltr/m2",null,"tariif, €/m2"]
[null,"VL_11",{"$f":"VLOOKUP(värv, Värvid[], 3, 0)","v":3.17},{"$f":"VLOOKUP(värv, Värvid[], 2, 0)","v":0.48},null,0.6]
[null,"värv","hind","kulu"]
[]
[null,"ruum","pikkus","laius","pindala","v_kogus","v_maks","töötasu","Kokku"]
[null,"R_01",5,4,{"$f":"pikkus*laius","v":20},{"$f":"kulu*pindala","v":9.6},{"$f":"hind*v_kogus","v":30.431999999999999},{"$f":"tariif*pindala","v":12},{"$f":"v_maks+töötasu","v":42.432000000000002}]
{"$rows_left_out":11}
{"sheet":"Laed_N (3)","index":16,"n_rows":17,"n_cols":10,"rows_kept":17,"cut":false,"hidden":false,"merged":[[0,6,0,7],[2,4,2,5]]}
[null,null,null,"validee-\nrimine","otsimine","valemite\nkopeerimine","Klipp \"Aadressid \nja nimed\"",null,"Diagramm","veeb"]
[]
[null,"Lagede värvimine II. Nimed",null,null,"Diagrammid"]
[]
[null,"värv","hind, €/ltr","kulu, ltr/m2",null,"tariif, €/m2"]
[null,"VL_05",{"$f":"VLOOKUP(värv, Värvid[], 3, 0)","v":4.0599999999999996},{"$f":"VLOOKUP(värv, Värvid[], 2, 0)","v":0.65},null,0.6]
[null,"värv","hind","kulu"]
[]
[null,"ruum","pikkus","laius","pindala","v_kogus","v_maks","töötasu","Kokku"]
[null,"R_01",5,4,{"$f":"Table8[[#This Row],[pikkus]]*Table8[[#This Row],[laius]]","v":20},{"$f":"kulu*Table8[[#This Row],[pindala]]","v":13},{"$f":"hind*[v_kogus]","v":52.779999999999994},{"$f":"tariif*Table8[[#This Row],[pindala]]","v":12},{"$f":"[v_maks]+Table8[[#This Row],[töötasu]]","v":64.78}]
{"$rows_left_out":8}
{"sheet":"Table_2_1","index":17,"n_rows":28,"n_cols":6,"rows_kept":28,"cut":false,"hidden":false,"merged":[[0,5,0,6]]}
[null,null,null,"Valideerimine","Otsimine","Klipp \"Tabeli loomine List-objektina\""]
[]
[]
[]
[]
[]
[]
[]
[]
[]
{"$rows_left_out":19}
{"sheet":"Table_2_2","index":18,"n_rows":19,"n_cols":6,"rows_kept":19,"cut":false,"hidden":false,"merged":[[0,5,0,6]]}
[null,null,null,"Valideerimine","Otsimine","Klipp \"Tabeli loomine List-objektina\""]
[]
[]
[]
[]
[]
[]
[]
[]
[]
{"$rows_left_out":10}
{"sheet":"Hinnakiri","index":19,"n_rows":14,"n_cols":3,"rows_kept":14,"cut":false,"hidden":false,"merged":[]}
[]
[]
[null,"Puidu hinnakiri"]
[]
[null,"liigid","hinnad"]
[null,"haab",76]
[null,"kask",120]
[null,"kuusk",160]
[null,"lepp",110]
[null,"mänd",150]
{"$rows_left_out":5}
{"sheet":"Fun_tab1_N","index":20,"n_rows":29,"n_cols":10,"rows_kept":29,"cut":false,"hidden":false,"merged":[]}
[]
[]
[null,"Funktsioonide tabuleerimine ja graafikud. Variant 1"]
[]
[null,"algus","lõpp","jaotisi","samm","p",null,"ymin","ymax","zkesk"]
[null,-10,10,20,{"$f":"(lõpp-algus)/jaotisi","v":1},2,null,{"$f":"MIN(y)","v":-2.9383717218207628},{"$f":"MAX(y)","v":2.7278922804770449},{"$f":"AVERAGE(z)","v":-0.21100102233361015}]
[]
[null,"x","y","z"]
[null,{"$f":"algus","v":-10},{"$f":"3*SIN(x+2)*COS(x/2)","v":-0.84193056732976213},{"$f":"IF(x<=p, 5*COS(2*x-3), 3*SIN(x+1))","v":-2.6641651016669874}]
[null,{"$f":"B9+samm","v":-9},0.41547004587670799,-2.7386463011213418]
{"$rows_left_out":20}
{"sheet":"Fun_tab2_NT","index":21,"n_rows":24,"n_cols":8,"rows_kept":24,"cut":false,"hidden":false,"merged":[]}
[]
[]
[null,"Funktsioonide tabuleerimine ja graafikud. Variant 2 - Table-objekt"]
[]
[null,"algus","samm","p",null,"zmin","zmax","ykesk"]
[null,-5,1,2,null,{"$f":"MIN(z)","v":-4.9499624830022269},{"$f":"MAX(z)","v":4.5372339072509806},{"$f":"AVERAGE(y)","v":6.8538160242857485E-2}]
[]
[null,"x","y","z"]
[null,{"$f":"algus","v":-5},{"$f":"3*SIN(x+2)*COS(x/2)","v":0.33917218044928332},{"$f":"IF(x<=p, 5*COS(2*x-3), 3*SIN(x+1))","v":4.5372339072509806}]
[null,{"$f":"B9+samm","v":-4},1.1352037429618924,2.2128489940253928E-2]
{"$rows_left_out":15}
{"sheet":"Värvimine_ÜP","index":22,"n_rows":3,"n_cols":2,"rows_kept":3,"cut":false,"hidden":false,"merged":[]}
[]
[]
[null,"Lagede värvimine III"]

{"sheet":"Ruumid","index":23,"n_rows":43,"n_cols":10,"rows_kept":43,"cut":false,"hidden":false,"merged":[]}
[]
[null,"Ruumid"]
[]
[null,"R_kood","pikkus","laius","kõrgus","pindala","S_pind","U_pind","A_pind","..."]
[null,"R_101",5,4,2.8,20,44.4,2.5,3.5]
[null,"R_102",6,5,3.2,30,62,3.5,4.9000000000000004]
[null,"R_103",6,3,2.8,18,44.4,2.5,3.5]
[null,"R_104",4,3,2.8,12,34.5,2,2.7]
[null,"R_105",4.8,3.2,2.8,15.4,39.5,2.2000000000000002,3.1]
[null,"R_106",4.2,3.8,2.8,16,39.5,2.2000000000000002,3.1]
{"$rows_left_out":34}
{"sheet":"Värvimine_tab","index":24,"n_rows":17,"n_cols":10,"rows_kept":17,"cut":false,"hidden":false,"merged":[]}
[]
[null,"Lagede värvimine III",null,null,"Siia teha tabel Värvimine"]
[]
[null,"J Ehitus","objekt","Kullaladu",null,"tariif",1.2,null,"muud",0.1]
[]
[null,"ruum","värv","pind","hind_v","kogus_v","maks_v","töötasu","muud_kulud","kulud_kokku"]
[null,"R_103","VL_05",{"$f":"VLOOKUP(ruum, Ruumid[], 5, 0)","v":18},{"$f":"VLOOKUP(värv, Värvid[], 3, 0)","v":4.0599999999999996},{"$f":"VLOOKUP(värv, Värvid[], 2, 0) * pind","v":11.700000000000001},{"$f":"hind_v * kogus_v","v":47.502000000000002},{"$f":"tariif * pind","v":21.599999999999998},{"$f":"muud * (maks_v+töötasu)","v":6.9102000000000006},{"$f":"maks_v+töötasu+muud_kulud","v":76.012200000000007}]
[null,"R_105","VL_01",{"$f":"VLOOKUP(ruum, Ruumid[], 5, 0)","v":15.4},{"$f":"VLOOKUP(värv, Värvid[], 3, 0)","v":3.05},{"$f":"VLOOKUP(värv, Värvid[], 2, 0) * pind","v":8.0080000000000009},24.424400000000002,18.48,4.2904400000000003,47.194839999999999]
[null,"R_106","VL_05",{"$f":"VLOOKUP(ruum, Ruumid[], 5, 0)","v":16},{"$f":"VLOOKUP(värv, Värvid[], 3, 0)","v":4.0599999999999996},{"$f":"VLOOKUP(värv, Värvid[], 2, 0) * pind","v":10.4},42.223999999999997,19.2,6.1423999999999994,67.566399999999987]
[null,"R_113","VL_05",{"$f":"VLOOKUP(ruum, Ruumid[], 5, 0)","v":14.124000000000001},{"$f":"VLOOKUP(värv, Värvid[], 3, 0)","v":4.0599999999999996},{"$f":"VLOOKUP(värv, Värvid[], 2, 0) * pind","v":9.1806000000000001},37.273235999999997,16.948799999999999,5.4222035999999996,59.644239599999992]
{"$rows_left_out":8}
{"sheet":"Fun_XY_N","index":25,"n_rows":19,"n_cols":13,"rows_kept":19,"cut":false,"hidden":false,"merged":[]}
[]
[null,"Kahemuutuja funktsiooni tabel ja graafik. Nimed"]
[]
[null,"ax","bx","nx","hx","a","ay","by","ny","hy"]
[null,2,7,10,{"$f":"(bx-ax)/nx","v":0.5},5,4,14,10,{"$f":"(by-ay)/ny","v":1}]
[]
[]
[null,null,{"$f":"ax","v":2},{"$f":"C8+hx","v":2.5},3,3.5,4,4.5,5,5.5,6,6.5,7]
[null,{"$f":"ay","v":4},{"$f":"a*SIN(x)*COS(y)","v":-2.971782312561519},-1.9559374962905975,-0.46121096522276855,1.1464360954263397,2.4733956165584545,3.1947816280692334,3.1339736751241327,2.3058596653556132,0.91319078984077973,-0.70305903966928407,-2.1471754962270904]
[null,{"$f":"B9+hy","v":5},1.2896664766473047,0.84881958167695593,0.20015204949425019,-0.4975196849514103,-1.0733812489153498,-1.3864416476650305,-1.3600527772234245,-1.0006755534186678,-0.39629805435701732,0.30510702978906479,0.93181127206311676]
{"$rows_left_out":10}
{"sheet":"Lisad","index":26,"n_rows":16,"n_cols":5,"rows_kept":16,"cut":false,"hidden":false,"merged":[]}
[]
[]
[]
[]
[]
[]
[]
[]
[null,null,null,null,"Lisad"]
[]
{"$rows_left_out":7}
{"sheet":"Valideerimine","index":27,"n_rows":28,"n_cols":8,"rows_kept":28,"cut":false,"hidden":false,"merged":[]}
[]
[]
[null,"Valideerimine loendiga"]
[]
[null,"Määrake valideerimine allpoololevatele lahtritele"]
[null,"sugu","mees","naine või mees, määrata Data Validation boksis"]
[null,"nädalapäev","L","määrata Data Validation boksis esitähtede abil"]
[null,"nädalapäev","laupäev","loendist nimega päevad",null,"Päevad"]
[null,"kuu","oktoober","loend Kuud  lehel abi",null,"Kuud"]
[null,"töötaja","Hunt","loend T_nimi lehel abi",null,"T_nimi"]
{"$rows_left_out":19}
{"sheet":"abi","index":28,"n_rows":16,"n_cols":11,"rows_kept":16,"cut":false,"hidden":false,"merged":[]}
[]
[null,null,null,null,null,"Puidu hinnakiri",null,null,"M_töötajad"]
[]
[null,"Kuud",null,"Päevad",null,"P_liigid","Hinnad",null,"T_nimi","Amet","Palk"]
[null,"jaanuar",null,"esmaspäev",null,"haab",76,null,"Karu","metsülem",5000]
[null,"veebruar",null,"teisipäev",null,"kask",120,null,"Hunt","turvamees",4500]
[null,"märts",null,"kolmapäev",null,"kuusk",160,null,"Rebane","ärimees",5600]
[null,"aprill",null,"neljapäev",null,"lepp",110,null,"Jänes","käskjalg",450]
[null,"mai",null,"reede",null,"mänd",150,null,"Siil","raamatupidaja",5467]
[null,"juuni",null,"laupäev",null,"paju",76,null,"Kits","diiler",4000]
{"$rows_left_out":7}
{"sheet":"Table_obj","index":29,"n_rows":28,"n_cols":15,"rows_kept":28,"cut":false,"hidden":false,"merged":[[27,1,27,10]]}
[]
[null,"Tabeli-objekti tulbapäisete ja tabelite nimede kasutamine valemites (struktuursed viited - structured referenced)"]
[null,"vt. kommentaari"]
[null,"Arvutite müügid",null,null,null,"km_prots",0.18,null,null,"Arvutid"," "]
[]
[null,"kuupäev","arvuti","arv","hind","maks_kga","käibemaks","maks_kta",null,"mark","protsessor","määlu, MB","ketas,GB","hind","hind_kta"]
[null,"2013-11-01","Frodo",3,{"$f":"VLOOKUP([arvuti], Arvukid[], 5, 0)","v":730},{"$f":"[hind] *[arv]","v":2190},{"$f":"km_prots * [maks_kga]","v":394.2},{"$f":"[maks_kga] - [käibemaks]","v":1795.8},null,"Aragorn","Pent 4; 3,0 ",512,160,350,{"$f":"Arvukid[[#This Row],[hind]] - km_prots * Arvukid[[#This Row],[hind]]","v":287}]
[null,"2013-11-01","Balrog",1,{"$f":"VLOOKUP([arvuti], Arvukid[], 5, 0)","v":320},{"$f":"[hind] *[arv]","v":320},{"$f":"km_prots * [maks_kga]","v":57.599999999999994},{"$f":"[maks_kga] - [käibemaks]","v":262.39999999999998},null,"Aura","AMD 64; 3,0",512,160,380,{"$f":"Arvukid[[#This Row],[hind]] - km_prots * Arvukid[[#This Row],[hind]]","v":311.60000000000002}]
[null,"2013-11-02","Frodo",6,{"$f":"VLOOKUP([arvuti], Arvukid[], 5, 0)","v":730},{"$f":"[hind] *[arv]","v":4380},{"$f":"km_prots * [maks_kga]","v":788.4},{"$f":"[maks_kga] - [käibemaks]","v":3591.6},null,"Balrog","Pent 4; 3,0 ",512,160,320,{"$f":"Arvukid[[#This Row],[hind]] - km_prots * Arvukid[[#This Row],[hind]]","v":262.39999999999998}]
[null,"2013-11-02","Polaris",4,{"$f":"VLOOKUP([arvuti], Arvukid[], 5, 0)","v":220},{"$f":"[hind] *[arv]","v":880},{"$f":"km_prots * [maks_kga]","v":158.4},{"$f":"[maks_kga] - [käibemaks]","v":721.6},null,"Eliisa","AMD S; 3,0",512,160,320,{"$f":"Arvukid[[#This Row],[hind]] - km_prots * Arvukid[[#This Row],[hind]]","v":262.39999999999998}]
{"$rows_left_out":19}
{"sheet":"VLOOKUP","index":30,"n_rows":37,"n_cols":7,"rows_kept":37,"cut":false,"hidden":false,"merged":[]}
[]
[null,"Otsimisfunktsioon VLOOKUP"]
[null,"Otsimine vertikaalsest tabelist"]
[null,"VLOOKUP(otsitav;  tabel;  tulemi_tulba_nr;  tunnus)"]
[null,"Otsib otsitavale vastavat väärtust tabeli esimesest tulbast ja"]
[null," tagastab tulemuse tulbast numbriga  tulemi_tulba_nr. "]
[]
[null,"otsitav - otsitav väärtus: konstant või viit lahtrile (aadress, nimi) "]
[null,"tabel - tabel, mille esimeses tulbas toimub otsimine: piirkonna aadess või nimi"]
[null,"tulemi_tulba_nr - tabeli tulba number, kust võetakse tagastatav väärtus: arv või arvavaldis"]
{"$rows_left_out":28}
{"sheet":"Diagr_1","index":31,"n_rows":11,"n_cols":6,"rows_kept":11,"cut":false,"hidden":false,"merged":[]}
[]
[null,"Diagramm töölehel"]
[]
[null,"Müükide maht "]
[]
[null,"Kv","Liha","Piim","Suhkur","Kokku"]
[null,1,150,140,150,{"$f":"SUM(C7:E7)","v":440}]
[null,2,175,172,180,{"$f":"SUM(C8:E8)","v":527}]
[null,3,149,210,156,{"$f":"SUM(C9:E9)","v":515}]
[null,4,177,146,227,{"$f":"SUM(C10:E10)","v":550}]
{"$rows_left_out":2}
{"sheet":"Addr_R1C1","index":33,"n_rows":0,"n_cols":0,"rows_kept":0,"cut":false,"hidden":false,"merged":[]}

{"sheet":"Kopeerimine","index":34,"n_rows":14,"n_cols":2,"rows_kept":14,"cut":false,"hidden":false,"merged":[]}
[]
[]
[null,"Valemite kopeerimise (paljundamise)  võimalused"]
[null," - lohistamine (vedamine) hiire vasakpoolse nupuga"]
[null," - topeltklõps hiire vasakpoolse nupuga"]
[null," - objektimenüü korraldused Copy ja Paste (või klahv Enter)"]
[null," - Edit-menüü korraldused Copy ja Paste (või klahv Enter)"]
[null," - riistariba nupud Copy ja Paste (või klahv Enter)"]
[null," - klahvid Ctrl+C ja Ctrl+V (või klahv Enter)"]
[]
{"$rows_left_out":5}
{"sheet":"Lohista","index":35,"n_rows":29,"n_cols":13,"rows_kept":29,"cut":false,"hidden":false,"merged":[]}
[]
[null,"Valemite kopeerimine (paljundamine) lohistamisega ja topeltklõpsuga"]
[]
[null,"hind",2000]
[]
[null,"a","b","pind","maks",null,"a",5,6,4,8,7,5]
[null,5,4,{"$f":"B7 * C7","v":20},{"$f":"$C$4 * D7","v":40000},null,"b",4,3,3,5,3,5]
[null,6,3,null,null,null,"pind",{"$f":"H6 * H7","v":20}]
[null,4,3,null,null,null,"maks",{"$f":"$C$4 * H8","v":40000}]
[null,8,5]
{"$rows_left_out":20}
{"sheet":"Menüüd","index":36,"n_rows":25,"n_cols":13,"rows_kept":25,"cut":false,"hidden":false,"merged":[]}
[]
[]
[]
[]
[]
[]
[]
[]
[]
[]
{"$rows_left_out":16}
{"sheet":"Nupud","index":37,"n_rows":22,"n_cols":13,"rows_kept":22,"cut":false,"hidden":false,"merged":[]}
[]
[]
[]
[]
[]
[]
[]
[]
[]
[]
{"$rows_left_out":13}
{"sheet":"Ctrl_C_V","index":38,"n_rows":22,"n_cols":13,"rows_kept":22,"cut":false,"hidden":false,"merged":[]}
[]
[]
[]
[]
[]
[]
[]
[]
[]
[]
{"$rows_left_out":13}
{"sheet":"Sheet1","index":39,"n_rows":0,"n_cols":0,"rows_kept":0,"cut":false,"hidden":false,"merged":[]}

{"sheet":"Sheet2","index":40,"n_rows":0,"n_cols":0,"rows_kept":0,"cut":false,"hidden":false,"merged":[]}